{"text_format":"3","workbook":"xlsx","n_sheets":10,"sheets":["Instructions","Disclaimer","Scenario Info","Basic Char.","Exp Determinants","Exp  Inhalation","Exp Dermal","Exp NOISE","Lists","DermalTable"],"not_rendered":{"images":16,"macros":1,"defined_names":25,"comments":3},"read":"whole","date_system":"1900"}

{"sheet":"Instructions","index":0,"n_rows":19,"n_cols":1,"rows_kept":19}
[" "]
{"$rows_empty":15}
[14]
[]
[{"$f":"SUBSTITUTE(SUBSTITUTE(LEFT(CELL(\"filename\",A1),FIND(\"]\",CELL(\"filename\",A1))),\"[\",\"\"),\"]\",\"\")","v":"https://aiha22042-my.sharepoint.com/personal/jmyers_aiha_org/Documents/Desktop/IHEST_V15.xlsm"}]

{"sheet":"Disclaimer","index":1,"n_rows":0,"n_cols":0,"rows_kept":0}

{"sheet":"Scenario Info","index":2,"n_rows":10,"n_cols":6,"rows_kept":10,"merged":[[1,2,1,3],[4,2,4,6],[6,2,6,6],[7,2,7,6],[8,2,8,3],[9,2,9,3]]}
[]
[{"$nulls":5},"Scenario number:"]
[]
[]
[null,"Scenario\ndescription or identification"]
[]
[null,"Company"]
[null,"Company Contact"]
[null,"Email"]
[null,"Phone"]

{"sheet":"Basic Char.","index":3,"n_rows":37,"n_cols":6,"rows_kept":37,"merged":[[3,2,3,8],[4,2,4,8],[5,2,5,8],[6,3,6,4],[7,2,7,8],[8,4,8,8],[15,2,15,8],[20,2,20,8],[21,2,21,8],[24,5,24,8],[25,5,25,8],[26,5,26,8],[27,5,27,8],[28,5,28,8],[29,5,29,8],[30,5,30,8],[35,5,35,8],[36,5,36,8]]}
[]
[]
[null,"Scenario Description"]
[null,"Process overview"]
[null,"Task description"]
[null,"Description of exposure controls"]
[null,"Number of individuals in SEG?"]
[null,"Description of SEG"]
[null,null,"Min","Max"]
[null,"duration  close to source,  ",null,null,"min"]
[null,"duration away from source\nbut still in work area,",null,null,"min"]
[null,"duration out of work area",null,null,"min"]
[null,"duration  close to source,  ",null,null,"min"]
[null,"duration away from source\nbut still in work area,",null,null,"min"]
[null,"duration out of work area",null,null,"min"]
[null,"Source description"]
[]
[]
[]
[null,"Chemical Agent Data"]
[null,"description of chemical makeup (individual contaminant or mixture)"]
[null,"chemical composition:"]
[null,"contaminant form"]
[null,"properties of contaminant (for skin contact)",{"$nulls":3},"Method or approaches ?"]
[1," temperature at which contaminant\nis handled/added to process",null,"°C"]
[1,"vapor pressure at temperature handled                       (values between 10-4 - 108 mm Hg)",null,"mm Hg"]
[1,"octanol/water partition coefficient\n(values between 10-3 to 107)",null,"log Kow"]
[1,"octanol/air partition coefficient\n(values between 105 - 1012)",null,"(units)"]
[1,"molecular weight compound",null,"g/mole"]
[1,"molecular weight chemical of interest",null,"g/mole"]
[1,"octanol/air partition coefficient of vehicle or mixture if chemical of interest is small component of overall mixture",null,"(units)"]
[]
[]
[]
[null,"Noise Source Data",{"$nulls":3},"Method or approaches ?"]
[2,"power",null,"(units)"]
[2,"intensity",null,"(units)"]

{"sheet":"Exp Determinants","index":4,"n_rows":34,"n_cols":9,"rows_kept":34,"merged":[[6,2,6,8],[12,2,12,8],[13,5,13,6],[22,2,22,3],[23,2,23,4],[24,2,24,8],[25,2,25,3]]}
[]
[]
[null,"INHALATION"]
[]
[null,"Ventilation Data"]
[]
[null,{"$f":"IF(A5=1,\"Description of ventilation\", \"Description of ventilation, number of doors, windows, oppotunity for air movements\")","v":"Description of ventilation, number of doors, windows, oppotunity for air movements"}]
[null,null,{"$f":"IF($A9,\"Mean\",\"Minimum\")","v":"Minimum"},{"$f":"IF($A9,\"SD\",\"Maximum\")","v":"Maximum"},null,null,{"$f":"IF($A9,\"Mean\",\"Minimum\")","v":"Minimum"},{"$f":"IF($A9,\"SD\",\"Maximum\")","v":"Maximum"}]
[false,"Ventilation rate",null,null,"m³/min","Local air velocity\n(at 1 meter from source)",null,null,"m/sec"]
[]
[null,"Physical Layout Data"]
[]
[null,"Room layout description\n(e.g. spacious, occluded areas\nor confined areas?)"]
[null,"Generation rate",null,"mg/min",null,"Chemical usage rate (as applicable)",null,null,"kg/day"]
[null,"Number of Sources:"]
[null,null,"Width","Length","Height",null,null,"Surface","volume"]
[null,"Room dimensions ",{"$nulls":3},"meter",null,{"$f":"IF(F17=\"feet\",C17*D17/(3.28083^2),C17*D17)","v":{"v":0,"d":"0.0 m²"}},{"$f":"IF(F17=\"feet\",C17*D17*E17/(3.28083^3),C17*D17*E17)","v":{"v":0,"d":"0.0 m³"}}]
[]
[]
[null,"DERMAL",{"$nulls":6},"Surface"]
[]
[2,"Exposed body surface areas",{"$nulls":6},{"$f":"DermalArea2(DermalTable!F4,DermalTable!F5,DermalTable!F6,DermalTable!F7,DermalTable!F8,DermalTable!F12,DermalTable!F15)","v":{"$error":"#NAME?"}}]
[2,"Duration/Intensity of dermal contact"]
[null,"Frequency of dermal contact"]
[null,"Dermal retention time"]
[null,"Concentration of chemical\nof interest in mixture"]
[]
[]
[null,"NOISE"]
[]
[null,null,"to come"]
[null,null,"to come"]
[null,null,"to come"]
[null,null,"to come"]

{"sheet":"Exp  Inhalation","index":5,"n_rows":20,"n_cols":30,"rows_kept":20,"merged":[[3,2,3,7],[3,8,3,13],[3,14,3,19],[3,20,3,25],[3,26,3,29]]}
[]
[]
[null,"INHALATION"]
[null,"sample type","Personal-Shift",{"$nulls":5},"Personal Task",{"$nulls":5},"Area - Shift",{"$nulls":5},"Area Task",{"$nulls":5},"Real Time Direct Reading"]
[null,"airborne concentration","#","Date","Conc.\nug/m3","ND\n?","LOQ","Duration","#","Date","Conc.","ND\n?","LOQ","Duration","#","Date","Conc.","ND\n?","LOQ","Duration","#","Date","Conc.","ND\n?","LOQ","Duration","#","Date","Conc.","Duration"]
[2,null,1,{"$nulls":5},1,{"$nulls":5},1,{"$nulls":5},1,{"$nulls":5},1]
[null,null,2,{"$nulls":5},2,{"$nulls":5},2,{"$nulls":5},2,{"$nulls":5},2]
[null,null,3,{"$nulls":5},3,{"$nulls":5},3,{"$nulls":5},3,{"$nulls":5},3]
[null,null,4,{"$nulls":5},4,{"$nulls":5},4,{"$nulls":5},4,{"$nulls":5},4]
[null,null,5,{"$nulls":5},5,{"$nulls":5},5,{"$nulls":5},5,{"$nulls":5},5]
[null,null,6,{"$nulls":5},6,{"$nulls":5},6,{"$nulls":5},6,{"$nulls":5},6]
[null,null,7,{"$nulls":5},7,{"$nulls":5},7,{"$nulls":5},7,{"$nulls":5},7]
[null,null,8,{"$nulls":5},8,{"$nulls":5},8,{"$nulls":5},8,{"$nulls":5},8]
[2,null,9,{"$nulls":5},9,{"$nulls":5},9,{"$nulls":5},9,{"$nulls":5},9]
[null,null,10,{"$nulls":5},10,{"$nulls":5},10,{"$nulls":5},10,{"$nulls":5},10]
[null,null,11,{"$nulls":5},11,{"$nulls":5},11,{"$nulls":5},11,{"$nulls":5},11]
[null,null,12,{"$nulls":5},12,{"$nulls":5},12,{"$nulls":5},12,{"$nulls":5},12]
[null,null,13,{"$nulls":5},13,{"$nulls":5},13,{"$nulls":5},13,{"$nulls":5},13]
[null,null,14,{"$nulls":5},14,{"$nulls":5},14,{"$nulls":5},14,{"$nulls":5},14]
[null,null,15,{"$nulls":5},15,{"$nulls":5},15,{"$nulls":5},15,{"$nulls":5},15]

{"sheet":"Exp Dermal","index":6,"n_rows":20,"n_cols":22,"rows_kept":20,"merged":[[3,2,3,7],[3,9,3,14],[3,16,3,21]]}
[]
[]
[null,"DERMAL"]
[null,"sample type","Surface",{"$nulls":6},"Body (e.g. hand wipe)",{"$nulls":6},"Biological Monitoring"]
[null," concentration","#","Date","Conc.","unit ","ND ?","LOQ",null,"#","Date","Conc.","unit ","ND ?","LOQ",null,"#","Date","Conc.","unit ","ND ?","LOQ"]
[null,null,1,null,null,"mg/cm²",{"$nulls":3},1,{"$nulls":6},1,null,null,"mg/g creatinine"]
[null,null,2,{"$nulls":6},2,{"$nulls":6},2]
[null,null,3,{"$nulls":6},3,{"$nulls":6},3]
[null,null,4,{"$nulls":6},4,{"$nulls":6},4]
[null,null,5,{"$nulls":6},5,{"$nulls":6},5]
[null,null,6,{"$nulls":6},6,{"$nulls":6},6]
[null,null,7,{"$nulls":6},7,{"$nulls":6},7]
[null,null,8,{"$nulls":6},8,{"$nulls":6},8]
[null,null,9,{"$nulls":6},9,{"$nulls":6},9]
[null,null,10,{"$nulls":6},10,{"$nulls":6},10]
[null,null,11,{"$nulls":6},11,{"$nulls":6},11]
[null,null,12,{"$nulls":6},12,{"$nulls":6},12]
[null,null,13,{"$nulls":6},13,{"$nulls":6},13]
[null,null,14,{"$nulls":6},14,{"$nulls":6},14]
[null,null,15,{"$nulls":6},15,{"$nulls":6},15]

{"sheet":"Exp NOISE","index":7,"n_rows":20,"n_cols":14,"rows_kept":20,"merged":[[3,2,3,5],[3,6,3,9],[3,10,3,13],[4,4,4,5],[4,8,4,9],[4,12,4,13]]}
[]
[]
[null,"NOISE","Carl - what options should we include?"]
[null,"sample type","8-hr TWA",{"$nulls":3},"Task-based",{"$nulls":3},"Instantaneous reading"]
[null,"concentration","#","Date","Level",null,"#","Date","Level",null,"#","Date","Level"]
[null,null,1,null,null,"(units)",1,null,null,"(units)",1,null,null,"(units)"]
[null,null,2,null,null,"(units)",2,null,null,"(units)",2,null,null,"(units)"]
[null,null,3,null,null,"(units)",3,null,null,"(units)",3,null,null,"(units)"]
[null,null,4,null,null,"(units)",4,null,null,"(units)",4,null,null,"(units)"]
[null,null,5,null,null,"(units)",5,null,null,"(units)",5,null,null,"(units)"]
[null,null,6,null,null,"(units)",6,null,null,"(units)",6,null,null,"(units)"]
[null,null,7,null,null,"(units)",7,null,null,"(units)",7,null,null,"(units)"]
[null,null,8,null,null,"(units)",8,null,null,"(units)",8,null,null,"(units)"]
[null,null,9,null,null,"(units)",9,null,null,"(units)",9,null,null,"(units)"]
[null,null,10,null,null,"(units)",10,null,null,"(units)",10,null,null,"(units)"]
[null,null,11,null,null,"(units)",11,null,null,"(units)",11,null,null,"(units)"]
[null,null,12,null,null,"(units)",12,null,null,"(units)",12,null,null,"(units)"]
[null,null,13,null,null,"(units)",13,null,null,"(units)",13,null,null,"(units)"]
[null,null,14,null,null,"(units)",14,null,null,"(units)",14,null,null,"(units)"]
[null,null,15,null,null,"(units)",15,null,null,"(units)",15,null,null,"(units)"]

{"sheet":"Lists","index":8,"n_rows":30,"n_cols":24,"rows_kept":30,"hidden":true}
[{"$nulls":16},"Version 15"]
[]
[null,"#","Duration","Temp","Vapor Pressure","Octanol/water part. coef.","Octanol/air part. coef.","Emission\n/Evap Rate","Ventilation Rates","local airflow","Contaminant physical state","Air Concentration","Surface Concentration Units","Contaminant physical state",null,"Dimension","Exposed area","Duration","Frequency","dermal retention","Body Concentrations","Biological spls","Chemical usage rate","Sample type"]
[null,1,"min","°C","mm Hg","Kow","Koa","µg/min","cfm","m/sec","vapor","ppm",null,"vapor","high viscosity","feet","small area/splash contact","contaminated surface","infrequent/unexpected","Unlikely (volatile, very dry, large particulate)","very low (<1%)",null,"kg/day","Personal-Shift"]
[null,2,"hours","°F","Torr","Log Kow","Log Koa","mg/sec","m³/min","f/min","aersosol","mg/m³",null,"aerosol","sticky","meter","one hand","overspray","incidental","Possible (less volatile, some adherence to skin)","low (<5%)","µg/dl","g/hour","Personal Task"]
[null,3,null,null,"Atm",null,null,"mg/min",null,"f/sec","coarse dust","f/cc",null,"coarse dust","powdery",null,"two hands","splash","intermittent","Likely (low volatility, high MW, sticky or consolidated on skin even if not visible)","moderate (5-50%)",null,"mg/minute","Area - Shift"]
[null,4,{"$nulls":5},"g/min",null,null,"fine dust",null,null,"fine dust","waxy",null,"arms","spray","continuous","Very likely (not volatile, MW>100, likely to adhere to skin)","high (50-100%)",null,"liters/hour","Area Task"]
[null,5,{"$nulls":5},"g/hour",null,null,"liquid",null,null,"liquid",null,null,"arms/torso/face","immersion",{"$nulls":4},"ml/minute","Real Time Direct Reading"]
[null,6,{"$nulls":8},"nanoscale",null,null,"nanoscale"]
[{"$nulls":10},"fume",null,null,"fume"]
[{"$nulls":10},"fibre",null,null,"fibre"]
[null,{"$f":"version","v":"Version 15"}]
[]
[]
[null,null,"Check list for scenario description: (draft)"]
[null,null,"Provide task summary if 8 hour TWA, or steps involved in completing a task, if task assessment"]
[null,null,"How does the worker(s) interact in this environement? E.g. essentially monitor this task/work, evaluate task manually (e.g. collect samples) or perform the task/work manually?"]
[null,null,"Describe the physical environment; is it compact or spacious?  Are there large objects/equipment that might redirect or interfere with airflow? Describe the traffic patterns - constant movement of workers/materials through the area, occasional movement, little movement, etc. "]
[]
[]
[]
[]
[{"$nulls":7},"Type","Surface ref 1"]
[{"$nulls":7},"Head",1360]
[{"$nulls":7},"Trunk (includes neck):",8270]
[{"$nulls":7},"Arms",3140]
[{"$nulls":7},"Forearms",1480]
[{"$nulls":7},"Hands",1070]
[{"$nulls":7},"Legs",6820]
[{"$nulls":7},"Total body ",20600]

{"sheet":"DermalTable","index":9,"n_rows":17,"n_cols":6,"rows_kept":17,"hidden":true}
[]
[]
[null,null,"Type","Surface","Yes/No","Surf"]
[null,1,"None",0,false,{"$f":"IF(E4,D4,\"\")","v":""}]
[null,2,"Total body ",20600,false,{"$f":"IF(E5,D5,0)","v":0}]
[null,3,"Head",1360,false,{"$f":"IF(E6,D6,0)","v":0}]
[null,4,"Legs",6820,false,{"$f":"IF(E7,D7,0)","v":0}]
[null,5,"Trunk (includes neck)",8270,true,8270]
[]
[null,1,"Fingertips",80]
[null,2,"Palm and fingers",500]
[null,3,"Hands",1070,null,{"$f":"IF(ChoiceHand=\"\",0,VLOOKUP(ChoiceHand,B10:D12,3,FALSE))","v":500}]
[]
[null,1,"ForeArms",1480]
[null,2,"Arms",3140,null,{"$f":"IF(ChoiceArm=\"\",0,VLOOKUP(ChoiceArm,B14:D15,3,FALSE))","v":3140}]
[]
[{"$nulls":5},{"$f":"SUM(F4:F15)","v":11910}]